Geroerd
top concept of: Codelijst bemonsteringstype.
notation: geroerd
in scheme: Codelijst bemonsteringstype.
definition: Monstername waarbij de oorspronkelijke structuur en gelaagdheid van het materiaal niet bewaard wordt. Het resulterende monster laat het niet toe een gedetailleerde beschrijving of bepaalde analyses met betrekking tot de structuur of gelaagdheid (bv. Bulkdensiteit, volumemassa, grondmechanische proeven, ....) uit te voeren.
type: Concept
note: Monstername waarbij de oorspronkelijke structuur en gelaagdheid van het materiaal niet bewaard wordt. Het resulterende monster laat het niet toe een gedetailleerde beschrijving of bepaalde analyses met betrekking tot de structuur of gelaagdheid (bv. Bulkdensiteit, volumemassa, grondmechanische proeven, ....) uit te voeren.

Via content negotiation
created with: NetKernel

Codelijst bemonsteringstype.
has top concept: Geroerd