Vloeistof
notation: vloeistof
top concept of: Codelijst bemonsteringstype.
definition: Het monster bestaat uit een van nature vloeibare stof (een stof die gemakkelijk vormveranderingen ondergaat, samendrukbaar is, maar zich verzet tegen deze volumeverandering). Het begrip gelaagdheid is niet relevant voor het karakteriseren van het materiaal waaruit het monster is genomen.
note: Het monster bestaat uit een van nature vloeibare stof (een stof die gemakkelijk vormveranderingen ondergaat, samendrukbaar is, maar zich verzet tegen deze volumeverandering). Het begrip gelaagdheid is niet relevant voor het karakteriseren van het materiaal waaruit het monster is genomen.
in scheme: Codelijst bemonsteringstype.
type: Concept

Codelijst bemonsteringstype.
has top concept: Vloeistof

Via content negotiation
created with: NetKernel